{"text_format":"1","workbook":"xlsx","n_sheets":3,"sheets":["Sheet1","Sheet2","Sheet3"],"not_rendered":{"charts":0,"images":1,"macros":1,"external_links":0,"defined_names":45,"comments":0,"pivot_tables":0},"unopened":[],"bounds":{"document_bytes":16777216,"sheet_cells":100000,"rows_first":2000,"rows_last":500,"rows_between":2000,"halvings":0,"cell_chars":16384,"cell_head_chars":4096},"cells_cut":0,"cells_raw":0,"read":"whole","date_system":"1900"}

{"sheet":"Sheet1","index":0,"n_rows":47,"n_cols":6,"rows_kept":47,"cut":false,"hidden":false,"merged":[[45,1,45,5],[27,1,27,4],[11,5,12,5],[13,5,14,5],[15,5,16,5],[32,1,32,4],[33,1,33,4],[26,1,26,4],[11,7,13,10],[46,1,46,4],[36,1,36,5],[43,1,43,5],[34,1,34,4],[35,1,35,4],[37,3,37,5],[39,1,39,4],[38,1,38,4],[40,1,40,4],[37,1,37,2],[41,1,41,4],[42,1,42,4],[21,1,21,4],[31,1,31,4],[29,3,29,5],[0,4,1,5],[44,3,44,5],[44,1,44,2],[18,3,18,5],[28,1,28,5],[29,1,29,2],[19,1,19,5],[20,1,20,5],[22,1,22,4],[23,1,23,4],[24,1,24,5],[25,1,25,4],[30,1,30,5],[18,1,18,2],[7,1,7,4],[15,2,16,2]]}
[null,null,null,null,"Daily Trust Accounting Checklist"]
[]
[]
[]
[null,"Click the Enable Content or Download button to proceed. Select your State and Operation. Enter prior day's date and your Branch name. "]
[null,"Complete each section and initial when complete.  Scan and send all documents (including completed checklist) to your OAC Contact by 10:00 am."]
[]
[null,"NOTE: To add your Operation, please submit Operation, Brand and OAC Contact information via",null,null,null," Job Aid Request"]
[]
[]
[null,"State:","Click to Select State",null,"Previous day’s date:"]
[]
[null,"Operation:","Click to Select Operation",null,"Enter Branch Name:"]
[]
[null,"Brand:",{"$f":"IF(ISNA(VLOOKUP(C13,Sheet2!A1:C183,2,FALSE)),\" \",VLOOKUP(C13,Sheet2!A1:C183,2,FALSE))","v":"Brand"},null,"Prepared by:"]
[null,null,{"$f":"IF(ISNA(VLOOKUP(C13,Sheet2!A1:C183,3,FALSE)),\" \",VLOOKUP(C13,Sheet2!A1:C183,3,FALSE))","v":"OAC Contact Information"}]
[null,"OAC Contact:",null,null,"Initial when complete:"]
[]
[null,"Receipts ",null,"Check this box if there are no receipts"]
[null,"Receipt Report (from midnight to midnight – may not match Bank Deposit)  "]
[null,"To print report, go to Reports > Trust Accounting folder > Transaction Activity report > Activity Report field: select Receipt"]
[null,"Print, review and scan the Receipts Report."]
[null,"Enter beginning receipt (Ref/Ck) number:"]
[null,"Enter ending receipt (Ref/Ck) number:"]
[null,"Bank Deposit (from yesterday’s banking – may not match Receipt Report)"]
[null,"Scan the handwritten bank deposit ticket."]
[null,"Scan the SoftPro Select group deposit ticket."]
[null,"Scan receipt(s) with copy of check.",null,null,null," "]
[]
[null,"Check Report",null,"Check this box if there are no checks  "]
[null,"To print report, go to Reports > Trust Accounting folder > Transaction Activity report > Activity Report field: select Check"]
[null,"Print, review and scan the Check Report."]
[null,"Enter beginning check (Ref/Ck) number:"]
[null,"Enter ending check (Ref/Ck) number:"]
[null,"Review the report for voided checks"]
[null,"Courier original voided checks (attached to transaction forms) to Accounting."]
[]
[null,"Manual Checks",null,"Check this box if there are no manual checks  "]
[null,"Enter beginning manual check number:"]
[null,"Enter ending manual check number:"]
[null,"Scan pink copies of manual checks."]
[null,"Scan Adjustment Transactions forms."]
[null,"Courier original voided/cancelled checks to Accounting."]
[]
[null,"Overdraft Report"]
[null,"To print report, go to Reports > Trust Accounting folder > Overdraft Report.  Ctrl + P to print."]
[null,"Print, review, initial and scan the Overdraft Report."]

{"sheet":"Sheet2","index":1,"n_rows":171,"n_cols":3,"rows_kept":171,"cut":false,"hidden":true,"merged":[]}
["Click to Select Operation","Brand","OAC Contact Information"]
["Select Another State",null,"OAC Contact Information"]
["Allegiance - Cypress","Allegiance Title","Sylvia.Freyling@fnf.com\nGlen.Betty@fnf.com"]
["Allegiance - Galleria","Allegiance Title","Sylvia.Freyling@fnf.com\nGlen.Betty@fnf.com"]
["Allegiance - Katy","Allegiance Title","Sylvia.Freyling@fnf.com\nGlen.Betty@fnf.com"]
["Allegiance - Lubbock","Allegiance Title","Sylvia.Freyling@fnf.com\nGlen.Betty@fnf.com"]
["Allegiance dba Aggieland","Allegiance Title","Sylvia.Freyling@fnf.com\nGlen.Betty@fnf.com"]
["Allegiance dba Excel Title","Allegiance Title","Sylvia.Freyling@fnf.com\nGlen.Betty@fnf.com"]
["AT Dallas","Alamo Title","DFW-ATEscrow@FNF.com"]
["AT Houston","Alamo Title","HOU-ATAccounting@fntg.com"]
["AT Innovative Title","Alamo Title","HOU-ATAccounting@fntg.com"]
["AT San Antonio","Alamo Title","HOU-SAATAccounting@fntg.com"]
["Bailey - Fee","Allegiance Title","Sylvia.Freyling@fnf.com\nGlen.Betty@fnf.com"]
["Charter Title","Fidelity Title","HOU-CTCAccounting@fntg.com"]
["CLT NCS Dallas","Commonwealth Land Title","DFW-COMEscrow@fnf.com"]
["Coppell","Allegiance Title","Sylvia.Freyling@fnf.com\nGlen.Betty@fnf.com"]
["CT Alameda","Chicago Title","Kimberly.Psarras@ctt.com"]
["CT Arizona","Chicago Title","AZ_Accounting@fnf.com"]
["CT Billings","Chicago Title","Stella.Leibrand@FNF.com"]
["CT Central Coast","Chicago Title","Cynthia.Ehlers@ctt.com"]
["CT Central Valley","Chicago Title","Maricela.Cabral@ctt.com"]
["CT CHI NCS Commercial","Chicago Title","CTIL-Accounting@ctt.com"]
["CT Contra Costa","Chicago Title","Kimberly.Psarras@ctt.com"]
["CT Dallas","Chicago Title","DFW-CTEscrow@FNF.com"]
["CT Division II Service Center","Chicago Title","Gina.Angulo@ctt.com"]
["CT Downstate","Chicago Title","DSIL-Accounting@CTT.com"]
["CT Ephrata","Chicago Title","Branch to keep File Copy"]
["CT Fresno/Madera","Chicago Title","Cynthia.Ehlers@ctt.com"]
["CT Great Falls","Chicago Title","Bobbi.Hernandez@fnf.com"]
["CT Helena","Chicago Title","Bobbi.Hernandez@fnf.com"]
["CT Houston","Chicago Title","HOU-CTAccounting@fntg.com"]
["CT HUD","Chicago Title","Kimberly.Psarras@ctt.com"]
["CT HUD-Sacramento,CA","Chicago Title","Kimberly.Psarras@ctt.com"]
["CT Inland Empire","Chicago Title","SanchezM@ctt.com"]
["CT Kansas City","Chicago Title","CTKC-Accounting@ctt.com"]
["CT Kennewick","Chicago Title","Branch to keep File Copy"]
["CT Kern","Chicago Title","Kimberly.Psarras@ctt.com"]
["CT King/Pierce","Chicago TItle","Hilda.Gumin@ctt.com"]
["CT Lassen Plumas","Chicago Title","DixonOAC@fnf.com"]
["CT Los Angeles","Chicago Title","FabrigasM@ctt.com"]
["CT Los Angeles-Titan-1","Chicago Title","SanchezM@CTT.com"]
["CT Los Angeles-Titan-2","Chicago Title","Sheila.Elazegui@ctt.com"]
["CT Metro","Chicago Title","CTIL-Accounting@ctt.com"]
["CT Michigan","Chicago Title","DL-ohioaccounting@fnf.com"]
["CT Monterey","Chicago Title","Kimberly.Psarras@ctt.com"]
["CT Morro Bay","Chicago Title","Cynthia.ehlers@ctt.com"]
["CT NCS Dallas","Chicago Title","DFW-CTEscrow@FNF.com"]
["CT North Ohio","Chicago Title","OhioAccounting@fnf.com"]
["CT Oklahoma","Chicago Title","DFW-OKEscrow@fnf.com"]
["CT Orange","Chicago Title","SanchezM@ctt.com"]
["CT Portland","Chicago Title","Send to Accounting"]
["CT Ritzville","Chicago Title","Branch to keep File Copy"]
["CT Roseville","Chicago Title","Susan.Cox@ctt.com"]
["CT Sacramento","Chicago Title","Kimberly.Psarras@ctt.com"]
["CT San Diego-1","Chicago Title","villlarinoj@ctt.com"]
["CT San Diego-2","Chicago Title","sheila.elazegui@ctt.com"]
["CT San Diego-3","Chicago Title","fabrigasm@ctt.com"]
["CT San Francisco","Chicago Title","Kimberly.Psarras@ctt.com"]
["CT San Mateo","Chicago Title","Kimberly.Psarras@ctt.com"]
["CT Santa Barbara","Chicago Title","DixonOAC@fnf.com"]
["CT Santa Clara","Chicago Title","."]
["CT Shasta","Chicago Title","DixonOAC@fnf.com"]
["CT South Ohio","Chicago Title","Ohio-Columbus-Accounting@fnf.com"]
["CT Thurston","Chicago Title","Stella.Leibrand@FNF.com"]
["CT Tulare/Kings","Chicago Title","Kimberly.Psarras@ctt.com"]
["CT Ventura","Chicago Title","FabrigasM@ctt.com"]
["CT Visalia 54421","Chicago Title","Kimberly.Psarras@ctt.com"]
["CT Wisconsin","Chicago Title","CTWI-Accounting@CTT.com"]
["CT/FT Cleveland Count Abstract","Chicago/Fidelity Title","DFW-OKEscrow@fnf.com"]
["CTA Austin","Chicago Title","Teri.Goldstein@ctt.com\nTammy.Meier@ctt.com"]
["CTI New Jersey","Chicago TItle","Wanda.Nelson@fnf.com"]
["CTI San Antonio","Chicago Title","HOU-SACTAccounting@fntg.com"]
["CTT San Antonio","Chicago Title","HOU-SACTAccounting@fntg.com"]
["CW Dallas","Commonwealth Title","DFW-CWEscrow@fnf.com"]
["CW Houston","Commonwealth Title","HOU-CTCAccounting@fntg.com"]
["CW Wollinka-Wikle Title","Commonwealth Title","Janet.Johnson@fnf.com"]
["DRN","Chicago/Fidelity Title","DixonOAC@fnf.com"]
["DSG","Chicago/Fidelity Title","DixonOAC@fnf.com"]
["Duncanville - Fee","Allegiance Title","Sylvia.Freyling@fnf.com\nGlen.Betty@fnf.com"]
["Flower Mound","Allegiance Title","Sylvia.Freyling@fnf.com\nGlen.Betty@fnf.com"]
["FNT Las Vegas - NCS","Chicago/Fidelity Title","Jenny.Dennis@fnf.com"]
["FNTG Lenders Direct","Fidelity Title","DixonOAC@fnf.com"]
["Fort Worth N Main - Fee","Allegiance Title","Sylvia.Freyling@fnf.com\nGlen.Betty@fnf.com"]
["Friendswood Fee","Allegiance Title","Sylvia.Freyling@fnf.com\nGlen.Betty@fnf.com"]
["Frisco","Allegiance Title","Sylvia.Freyling@fnf.com\nGlen.Betty@fnf.com"]
["FT Alameda/Contra Costa","Fidelity Title","DixonOAC@fnf.com"]
["FT Arizona","Fidelity Title","AZ_Accounting@fnf.com"]
["FT Barrier Island","Fidelity Title","Janet.Johnson@fnf.com"]
["FT Bigfork","Fidelity Title","Stella.Leibrand@FNF.com"]
["FT Butte","Fidelity Title","DixonOAC@fnf.com"]
["FT Central Coast","Fidelity Title","Cynthia.Ehlers@ctt.com"]
["FT CHI NCS Commercial","Fidelity Title","FNTIL-Accounting@FNF.com"]
["FT Coos","Fidelity Title","Branch to keep File Copy"]
["FT Dallas","Fidelity Title","DFW-FNTEscrow@FNF.com"]
["FT El Dorado","Fidelity Title","DixonOAC@fnf.com"]
["FT Eugene","Fidelity Title","Branch to keep File Copy"]
["FT Fresno/Madera","Fidelity Title","DixonOAC@fnf.com"]
["FT Hawaii","Fidelity Title","DixonOAC@fnf.com"]
["FT Houston","Fidelity Title","HOU-FTAccounting@fntg.com"]
["FT Humboldt","Fidelity Title","DixonOAC@fnf.com"]
["FT Idaho","Fidelity Title","mary.keenan@fnf.com"]
["FT IL RLC","Fidelity Title","FNTIL-Accounting@FNF.com"]
["FT Indiana","Fidelity Title","Deb.Prenslow@fnf.com"]
["FT Kalispell","Fidelity Title","Stella.Leibrand@FNF.com"]
["FT Lake","Fidelity TItle","DixonOAC@fnf.com"]
["FT Marin","Fidelity Title","DixonOAC@fnf.com"]
["FT Merced","Fidelity Title","DixonOAC@fnf.com"]
["FT Metro","Fidelity Title","FNTIL-Accounting@FNF.com"]
["FT Michigan","Fidelity Title","Christine.M.Smith@fnf.com"]
["FT Napa","Fidelity Title","DixonOAC@fnf.com"]
["FT Nevada","Fidelity Title","DixonOAC@fnf.com"]
["FT New Mexico","Fidelity Title","pwalker@fnf.com"]
["FT Pierce","Fidelity Title","Stella.Leibrand@FNF.com"]
["FT Placer","Fidelity Title","DixonOAC@fnf.com"]
["FT Portland","Fidelity Title","Send to Accounting"]
["FT Sacramento","Fidelity Title","DixonOAC@fnf.com"]
["FT Salem","Fidelity Title","Send to Accounting"]
["FT San Francisco","Fidelity Title","DixonOAC@fnf.com"]
["FT San Mateo","Fidelity Title","DixonOAC@fnf.com"]
["FT Santa Barbara","Fidelity Title","DixonOAC@fnf.com"]
["FT Santa Clara","Fidelity Title","DixonOAC@fnf.com"]
["FT Shasta","Fidelity Title","DixonOAC@fnf.com"]
["FT Silverdale","Fidelity Title","StellaIleah.Daniels@FNF.com"]
["FT Solano","Fidelity Title","DixonOAC@fnf.com"]
["FT Sonoma","Fidelity Title","DixonOAC@fnf.com"]
["FT Sutter Yuba","Fidelity Title","DixonOAC@fnf.com"]
["FT Tampa","Fidelity Title","ChrSanchez@FNF.com"]
["FT Tuolumne","Fidelity Title","Monique.Searcy@ctt.com"]
["FT Vancouver","Fidelity Title","Debbie.A.Wong@FNF.com"]
["FT Ventura","Fidelity Title","Gina.Angulo@ctt.com\nSusan.cox@ctt.com"]
["FT Western Title & Escrow","Fidelity Title","Do NOT send to Accounting\nBranch to keep File Copy 30 Days"]
["FT Whitefish","Fidelity Title","Stella.Leibrand@FNF.com"]
["FT-StarTex","Fidelity Title","HOU-STXAccounting@fntg.com"]
["FT-West Texas Abstract Co","Fidelity Title","HOU-WTXAccounting@fntg.com"]
["Garland","Allegiance Title","Sylvia.Freyling@fnf.com\nGlen.Betty@fnf.com"]
["Grand Canyon Title",null,"AZ_Accounting@fnf.com"]
["Grand Prairie - Fee","Allegiance Title","Sylvia.Freyling@fnf.com\nGlen.Betty@fnf.com"]
["Humboldt Land Title","Chicago Title","DixonOAC@fnf.com"]
["Lake Worth","Allegiance Title","Sylvia.Freyling@fnf.com\nGlen.Betty@fnf.com"]
["LT Arizona","Lawyers Title","AZ_Accounting@fnf.com"]
["LT Dallas","Lawyers Title","DFW-LTEscrow@fnf.com"]
["LT Portland","Lawyers Title","mary.keenan@fnf.com"]
["LT Ventura","Lawyers Title","OAC to complete"]
["LT/CT Amarillo","Lawyers Title/Chicago Title","DFW-AMAEscrow@fnf.com"]
["LTC Burlingame","Lawyers Title","Cynthia.Ehlers@ctt.com"]
["LTC Castro Valley","Lawyers Title","Cynthia.Ehlers@ctt.com"]
["LTC Danville","Lawyers Title","Cynthia.Ehlers@ctt.com"]
["LTC Menlo Park","Lawyers Title","Cynthia.Ehlers@ctt.com"]
["LTC Menlo Park 2","Lawyers Title","Cynthia.Ehlers@ctt.com"]
["LTC Pleasanton","Lawyers Title","Cynthia.Ehlers@ctt.com"]
["LTC San Carlos","Lawyers Title","Cynthia.Ehlers@ctt.com"]
["LTC San Francisco","Lawyers Title","Cynthia.Ehlers@ctt.com"]
["LTC Santa Clara","Lawyers Title","Cynthia.Ehlers@ctt.com"]
["Mansfield - Fee","Allegiance Title","Sylvia.Freyling@fnf.com\nGlen.Betty@fnf.com"]
["McKinney","Allegiance Title","Sylvia.Freyling@fnf.com\nGlen.Betty@fnf.com"]
["Plano","Allegiance Title","Sylvia.Freyling@fnf.com\nGlen.Betty@fnf.com"]
["Preston Center","Allegiance Title","Sylvia.Freyling@fnf.com\nGlen.Betty@fnf.com"]
["RLC - Washington Square",null,"lleah.Daniels@FNF.com"]
["Rockwell - Fee","Allegiance Title","Sylvia.Freyling@fnf.com\nGlen.Betty@fnf.com"]
["Security Title Agency",null,"AZ_Accounting@fnf.com"]
["Southlake","Allegiance Title","Sylvia.Freyling@fnf.com\nGlen.Betty@fnf.com"]
["Sugar Land Fee","Allegiance Title","Sylvia.Freyling@fnf.com\nGlen.Betty@fnf.com"]
["TT Astoria","Ticor Title","Branch to keep File Copy"]
["TT Columbia","Ticor Title","Branch to keep File Copy"]
["TT Coos","Ticor Title","Branch to keep File Copy"]
["TT Kennewick","Ticor Title","Seattleoac-escrow@fnf.com"]
["TT Kern","Ticor Title","Cynthia.Ehlers@ctt.com"]
["TT Medford","Ticor Title","Branch to keep File Copy"]
["TT Portland","Ticor Title","Send to Accounting"]
["TT Salem","Ticor Title","Send to Accounting"]
["Turtle Creek","Allegiance Title","Sylvia.Freyling@fnf.com\nGlen.Betty@fnf.com"]

{"sheet":"Sheet3","index":2,"n_rows":72,"n_cols":39,"rows_kept":72,"cut":false,"hidden":true,"merged":[]}
["State",null,"California",null,"Florida",null,"Illinois",null,"Texas",null,"Oregon",null,"Washington",null,"Wisconsin",null,"New_Mexico",null,"Arizona",null,"Michigan",null,"Idaho",null,"Hawaii",null,"Montana",null,"Oklahoma",null,"Indiana",null,"Ohio",null,"Missouri",null,"New_Jersey",null,"Nevada"]
["Click to Select State",null,"Click to Select Operation",null,"Click to Select Operation",null,"Click to Select Operation",null,"Click to Select Operation",null,"Click to Select Operation",null,"Click to Select Operation",null,"Click to Select Operation",null,"Click to Select Operation",null,"Click to Select Operation",null,"Click to Select Operation",null,"Click to Select Operation",null,"Click to Select Operation",null,"Click to Select Operation",null,"Click to Select Operation",null,"Click to Select Operation",null,"Click to Select Operation",null,"Click to Select Operation",null,"Click to Select Operation",null,"Click to Select Operation"]
[]
["Arizona",null,"CT Alameda",null,"CT Tampa",null,"CT CHI NCS Commercial",null,"Allegiance - Cypress",null,"CT Portland",null,"CT Ephrata",null,"CT Wisconsin",null,"FT New Mexico",null,"CT Arizona",null,"CT Michigan",null,"FT Idaho",null,"FT Hawaii",null,"CT Billings",null,"CT/FT Cleveland Count Abstract",null,"FT Indiana",null,"CT North Ohio",null,"CT Kansas City",null,"CTI New Jersey",null,"FNT Las Vegas - NCS"]
["California",null,"CT Central Coast",null,"CW Wollinka-Wikle Title",null,"CT Downstate",null,"Allegiance - Katy",null,"FT Coos",null,"CT Kennewick",null,null,null,null,null,"FT Arizona",null,"FT Michigan",null,null,null,null,null,"CT Great Falls",null,"CT Oklahoma",null,null,null,"CT South Ohio"]
["Florida",null,"CT Central Valley",null,"FT Barrier Island",null,"CT Metro",null,"Allegiance - Galleria",null,"FT Eugene",null,"CT King/Pierce",null,null,null,null,null,"FT Butte",null,null,null,null,null,null,null,"CT Helena"]
["Hawaii",null,"CT Contra Costa",null,"FT Tampa",null,"FT CHI NCS Commercial",null,"Allegiance - Lubbock",null,"FT Portland",null,"CT Ritzville",null,null,null,null,null,"Grand Canyon Title",null,null,null,null,null,null,null,"FT Bigfork"]
["Idaho",null,"CT Division II Service Center",null,null,null,"FT IL RLC",null,"Allegiance dba Excel Title",null,"FT Salem",null,"CT Thurston",null,null,null,null,null,"LT Arizona",null,null,null,null,null,null,null,"FT Kalispell"]
["Illinois",null,"CT Fresno/Madera",null,null,null,"FT Metro",null,"Allegiance dba Aggieland",null,"FT Western Title & Escrow",null,"FT Pierce",null,null,null,null,null,"Security Title Agency",null,null,null,null,null,null,null,"FT Whitefish"]
["Indiana",null,"CT HUD",null,null,null,null,null,"AT Dallas",null,"LT Portland",null,"FT Silverdale"]
["Michigan",null,"CT HUD-Sacramento,CA",null,null,null,null,null,"AT Houston",null,"RLC - Washington Square",null,"FT Vancouver"]
["Missouri",null,"CT Inland Empire",null,null,null,null,null,"AT Innovative Title",null,"TT Astoria",null,"TT Kennewick"]
["Montana",null,"CT Kern",null,null,null,null,null,"AT San Antonio",null,"TT Columbia"]
["Nevada",null,"CT Lassen Plumas",null,null,null,null,null,"Bailey - Fee",null,"TT Coos"]
["New_Mexico",null,"CT Los Angeles",null,null,null,null,null,"Charter Title",null,"TT Medford"]
["New_Jersey",null,"CT Los Angeles-Titan-1",null,null,null,null,null,"CLT NCS Dallas",null,"TT Portland"]
["Ohio",null,"CT Los Angeles-Titan-2",null,null,null,null,null,"Coppell",null,"TT Salem"]
["Oklahoma",null,"CT Monterey",null,null,null,null,null,"CT Dallas"]
["Oregon",null,"CT Morro Bay",null,null,null,null,null,"CT NCS Dallas"]
["Texas",null,"CT Orange",null,null,null,null,null,"CT Houston"]
["Washington",null,"CT Roseville",null,null,null,null,null,"CTA Austin"]
["Wisconsin",null,"CT Sacramento",null,null,null,null,null,"CTI San Antonio"]
[null,null,"CT San Diego-1",null,null,null,null,null,"CTT San Antonio"]
[null,null,"CT San Diego-2",null,null,null,null,null,"CW Dallas"]
[null,null,"CT San Diego-3",null,null,null,null,null,"CW Houston"]
[null,null,"CT San Francisco",null,null,null,null,null,"Duncanville - Fee"]
[null,null,"CT San Mateo",null,null,null,null,null,"Flower Mound"]
[null,null,"CT Santa Barbara",null,null,null,null,null,"Fort Worth N Main - Fee"]
[null,null,"CT Santa Clara",null,null,null,null,null,"Friendswood Fee"]
[null,null,"CT Shasta",null,null,null,null,null,"Frisco"]
[null,null,"CT Tulare/Kings",null,null,null,null,null,"FT Dallas"]
[null,null,"CT Ventura",null,null,null,null,null,"FT Houston"]
[null,null,"CT Visalia 54421",null,null,null,null,null,"FT-StarTex"]
[null,null,"DRN",null,null,null,null,null,"FT-West Texas Abstract Co"]
[null,null,"DSG",null,null,null,null,null,"Garland"]
[null,null,"FNTG Lenders Direct",null,null,null,null,null,"Grand Prairie - Fee"]
[null,null,"FT Alameda/Contra Costa",null,null,null,null,null,"Lake Worth"]
[null,null,"FT Butte",null,null,null,null,null,"LT/CT Amarillo"]
[null,null,"FT Central Coast",null,null,null,null,null,"LT Dallas"]
[null,null,"FT El Dorado",null,null,null,null,null,"Mansfield - Fee"]
[null,null,"FT Fresno/Madera",null,null,null,null,null,"McKinney"]
[null,null,"FT Hawaii",null,null,null,null,null,"Plano"]
[null,null,"FT Lake",null,null,null,null,null,"Preston Center"]
[null,null,"FT Humboldt",null,null,null,null,null,"Rockwell - Fee"]
[null,null,"FT Marin",null,null,null,null,null,"Sugar Land Fee"]
[null,null,"FT Merced",null,null,null,null,null,"Southlake"]
[null,null,"FT Napa",null,null,null,null,null,"Turtle Creek"]
[null,null,"FT Nevada"]
[null,null,"FT Placer"]
[null,null,"FT Sacramento"]
[null,null,"FT San Francisco"]
[null,null,"FT San Mateo"]
[null,null,"FT Santa Barbara"]
[null,null,"FT Santa Clara"]
[null,null,"FT Shasta"]
[null,null,"FT Solano"]
[null,null,"FT Sonoma"]
[null,null,"FT Sutter Yuba"]
[null,null,"FT Tuolumne"]
[null,null,"FT Ventura"]
[null,null,"Humboldt Land Title"]
[null,null,"LT Ventura"]
[null,null,"LTC Burlingame"]
[null,null,"LTC Castro Valley"]
[null,null,"LTC Danville"]
[null,null,"LTC Menlo Park"]
[null,null,"LTC Menlo Park 2"]
[null,null,"LTC Pleasanton"]
[null,null,"LTC San Carlos"]
[null,null,"LTC San Francisco"]
[null,null,"LTC Santa Clara"]
[null,null,"TT Kern"]